BDBM118081 US8637558, 118::US8637558, 130
SMILES Oc1[nH]c(=O)sc1Cc1ccc(OCCC2CCCC2)cc1
InChI Key InChIKey=PYLTYBILLAJMSW-UHFFFAOYSA-N
Data  2 IC50
  Tab Delimited (TSV)   2D SDfile   Computed 3D by Vconf -m prep SDfile
Find this compound or compounds like it in BindingDB:
Activity Spreadsheet -- Enzyme Inhibition Constant Data from BindingDB
Found 2 hits for monomerid = 118081
Target15-hydroxyprostaglandin dehydrogenase [NAD(+)](Homo sapiens (Human))
Industry-Academic Cooperation Foundation, Chosun University
US Patent
LigandPNGBDBM118081(US8637558, 118 | US8637558, 130)
Affinity DataIC50:  2.21E+3nMpH: 7.5Assay Description:Experimental was performed by measuring the formation of NADH at 340 nm with a fluorescence spectrophotometer. Specifically, 2 ml (in total) of the s...
In DepthDetails US Patent
Target15-hydroxyprostaglandin dehydrogenase [NAD(+)](Homo sapiens (Human))
Industry-Academic Cooperation Foundation, Chosun University
US Patent
LigandPNGBDBM118081(US8637558, 118 | US8637558, 130)
Affinity DataIC50:  777nMpH: 7.5Assay Description:Experimental was performed by measuring the formation of NADH at 340 nm with a fluorescence spectrophotometer. Specifically, 2 ml (in total) of the s...
In DepthDetails US Patent